{"text_format":"1","workbook":"xlsx","n_sheets":19,"sheets":["Instructions","Main","Data","Starting Bal","Addnl Info","30-yr","Budget Sum","Thermometer","Chart - Expenses","Chart - FP","Chart - Cash","Chart - %","Solver","Coding-F","Coding-B","Output-F","Output-B","SA Risk","wksCommandBars"],"not_rendered":{"charts":12,"images":5,"macros":1,"external_links":0,"defined_names":188,"comments":1,"pivot_tables":0},"unopened":[{"sheet":"Chart - Expenses","index":8,"reason":"not_a_worksheet"},{"sheet":"Chart - FP","index":9,"reason":"not_a_worksheet"},{"sheet":"Chart - Cash","index":10,"reason":"not_a_worksheet"},{"sheet":"Chart - %","index":11,"reason":"not_a_worksheet"}],"bounds":{"document_bytes":16777216,"sheet_cells":100000,"rows_first":2000,"rows_last":500,"rows_between":2000,"halvings":0,"cell_chars":16384,"cell_head_chars":4096},"cells_cut":0,"cells_raw":0,"read":"whole","date_system":"1900"}

{"sheet":"Instructions","index":0,"n_rows":25,"n_cols":3,"rows_kept":25,"cut":false,"hidden":false,"merged":[]}
[]
[null,"ARInc Reserves Analysis Spreadsheet!"]
[null,{"$f":"Main!D7","v":"Analysis File V4.1, 9/14"}]
[]
[]
[]
[]
[]
{"$rows_left_out":18}
{"sheet":"Main","index":1,"n_rows":91,"n_cols":6,"rows_kept":91,"cut":false,"hidden":false,"merged":[[15,4,15,5],[50,2,50,5]]}
[]
[]
[]
[]
[]
[]
[null,null,null,"Analysis File V4.1, 9/14"]
[]
{"$rows_left_out":84}
{"sheet":"Data","index":2,"n_rows":44,"n_cols":161,"rows_kept":44,"cut":false,"hidden":false,"merged":[[28,9,28,10],[28,23,28,24]]}
[]
[null,null,null,null,null,null,null,null,null,null,null,null,null,null,null,null,null,null,null,null,null,null,null,null,null,null,null,null,null,null,null,null,null,null,null,null,null,null,null,null,null,null,null,null,null,null,null,null,null,null,null,null,"Year Increment",0,1,2,3,4,null,"Year Increment",5,6,7,8,9,null,"Year Increment",10,11,12,13,14,null,"Year Increment",15,16,17,18,19,null,"Year Increment",20,21,22,23,24,null,"Year Increment",25,26,27,28,29,30]
[null,null,null,null,null,null,null,null,null,null,null,null,null,null,null,null,null,null,null,null,null,null,null,null,null,null,null,null,null,null,null,null,null,null,null,null,null,null,null,null,null,null,null,null,null,null,null,null,null,null,null,null,"Inflation",{"$f":"(1+Main!$D$22)^BB2","v":1},{"$f":"(1+Main!$D$22)^BC2","v":1.03},{"$f":"(1+Main!$D$22)^BD2","v":1.0609},{"$f":"(1+Main!$D$22)^BE2","v":1.092727},{"$f":"(1+Main!$D$22)^BF2","v":1.1255088099999999},null,"Inflation",{"$f":"(1+Main!$D$22)^BI2","v":1.1592740742999998},{"$f":"(1+Main!$D$22)^BJ2","v":1.1940522965289999},{"$f":"(1+Main!$D$22)^BK2","v":1.22987386542487},{"$f":"(1+Main!$D$22)^BL2","v":1.2667700813876159},{"$f":"(1+Main!$D$22)^BM2","v":1.3047731838292445},null,"Inflation",{"$f":"(1+Main!$D$22)^BP2","v":1.3439163793441218},{"$f":"(1+Main!$D$22)^BQ2","v":1.3842338707244455},{"$f":"(1+Main!$D$22)^BR2","v":1.4257608868461786},{"$f":"(1+Main!$D$22)^BS2","v":1.4685337134515639},{"$f":"(1+Main!$D$22)^BT2","v":1.512589724855111},null,"Inflation",{"$f":"(1+Main!$D$22)^BW2","v":1.5579674166007644},{"$f":"(1+Main!$D$22)^BX2","v":1.6047064390987871},{"$f":"(1+Main!$D$22)^BY2","v":1.6528476322717507},{"$f":"(1+Main!$D$22)^BZ2","v":1.7024330612399032},{"$f":"(1+Main!$D$22)^CA2","v":1.7535060530771003},null,"Inflation",{"$f":"(1+Main!$D$22)^CD2","v":1.8061112346694133},{"$f":"(1+Main!$D$22)^CE2","v":1.8602945717094954},{"$f":"(1+Main!$D$22)^CF2","v":1.9161034088607805},{"$f":"(1+Main!$D$22)^CG2","v":1.973586511126604},{"$f":"(1+Main!$D$22)^CH2","v":2.0327941064604018},null,"Inflation",{"$f":"(1+Main!$D$22)^CK2","v":2.0937779296542138},{"$f":"(1+Main!$D$22)^CL2","v":2.1565912675438406},{"$f":"(1+Main!$D$22)^CM2","v":2.2212890055701555},{"$f":"(1+Main!$D$22)^CN2","v":2.2879276757372602},{"$f":"(1+Main!$D$22)^CO2","v":2.3565655060093778},{"$f":"(1+Main!$D$22)^CP2","v":2.4272624711896591}]
[null,null,null,null,null,null,null,null,null,null,null,null,null,null,null,null,null,null,null,null,null,null,null,null,null,null,null,null,null,null,null,null,null,null,null,null,null,null,null,null,null,null,null,null,null,null,null,null,null,null,null,null,"Alt Contribution rate (total)",{"$f":"Main!$D48*Main!$D61*Main!$D31","v":5940},{"$f":"IF(BC2<=Main!$D33,(Main!$D31*Main!$D48)*(1+Main!$D32),IF(BC2<=(Main!$D33+Main!$D35),(Main!$D31*Main!$D48)*(1+Main!$D34),(Main!$D31*Main!$D48)))","v":6118.2},{"$f":"IF(BD2<=Main!$D33,BC4*(1+Main!$D32),IF(BD2<=(Main!$D35),BC4*(1+Main!$D34),BC4))","v":6301.7460000000001},{"$f":"IF(BE2<=Main!$D33,BD4*(1+Main!$D32),IF(BE2<=(Main!$D35),BD4*(1+Main!$D34),BD4))","v":6490.7983800000002},{"$f":"IF(BF2<=Main!$D33,BE4*(1+Main!$D32),IF(BF2<=(Main!$D35),BE4*(1+Main!$D34),BE4))","v":6685.5223314000004},null,"Alt Contribution rate (total)",{"$f":"IF(BI2<=Main!$D33,BF4*(1+Main!$D32),IF(BI2<=(Main!$D35),BF4*(1+Main!$D34),BF4))","v":6886.088001342001},{"$f":"IF(BJ2<=Main!$D33,BI4*(1+Main!$D32),IF(BJ2<=(Main!$D35),BI4*(1+Main!$D34),BI4))","v":7092.6706413822612},{"$f":"IF(BK2<=Main!$D33,BJ4*(1+Main!$D32),IF(BK2<=(Main!$D35),BJ4*(1+Main!$D34),BJ4))","v":7305.4507606237294},{"$f":"IF(BL2<=Main!$D33,BK4*(1+Main!$D32),IF(BL2<=(Main!$D35),BK4*(1+Main!$D34),BK4))","v":7524.6142834424418},{"$f":"IF(BM2<=Main!$D33,BL4*(1+Main!$D32),IF(BM2<=(Main!$D35),BL4*(1+Main!$D34),BL4))","v":7750.3527119457149},null,"Alt Contribution rate (total)",{"$f":"IF(BP2<=Main!$D33,BM4*(1+Main!$D32),IF(BP2<=(Main!$D35),BM4*(1+Main!$D34),BM4))","v":7982.8632933040863},{"$f":"IF(BQ2<=Main!$D33,BP4*(1+Main!$D32),IF(BQ2<=(Main!$D35),BP4*(1+Main!$D34),BP4))","v":8222.3491921032091},{"$f":"IF(BR2<=Main!$D33,BQ4*(1+Main!$D32),IF(BR2<=(Main!$D35),BQ4*(1+Main!$D34),BQ4))","v":8469.0196678663051},{"$f":"IF(BS2<=Main!$D33,BR4*(1+Main!$D32),IF(BS2<=(Main!$D35),BR4*(1+Main!$D34),BR4))","v":8723.090257902295},{"$f":"IF(BT2<=Main!$D33,BS4*(1+Main!$D32),IF(BT2<=(Main!$D35),BS4*(1+Main!$D34),BS4))","v":8984.7829656393642},null,"Alt Contribution rate (total)",{"$f":"IF(BW2<=Main!$D33,BT4*(1+Main!$D32),IF(BW2<=(Main!$D35),BT4*(1+Main!$D34),BT4))","v":9254.3264546085447},{"$f":"IF(BX2<=Main!$D33,BW4*(1+Main!$D32),IF(BX2<=(Main!$D35),BW4*(1+Main!$D34),BW4))","v":9531.9562482468009},{"$f":"IF(BY2<=Main!$D33,BX4*(1+Main!$D32),IF(BY2<=(Main!$D35),BX4*(1+Main!$D34),BX4))","v":9817.9149356942053},{"$f":"IF(BZ2<=Main!$D33,BY4*(1+Main!$D32),IF(BZ2<=(Main!$D35),BY4*(1+Main!$D34),BY4))","v":10112.452383765032},{"$f":"IF(CA2<=Main!$D33,BZ4*(1+Main!$D32),IF(CA2<=(Main!$D35),BZ4*(1+Main!$D34),BZ4))","v":10415.825955277984},null,"Alt Contribution rate (total)",{"$f":"IF(CD2<=Main!$D33,CA4*(1+Main!$D32),IF(CD2<=(Main!$D35),CA4*(1+Main!$D34),CA4))","v":10728.300733936323},{"$f":"IF(CE2<=Main!$D33,CD4*(1+Main!$D32),IF(CE2<=(Main!$D35),CD4*(1+Main!$D34),CD4))","v":11050.149755954413},{"$f":"IF(CF2<=Main!$D33,CE4*(1+Main!$D32),IF(CF2<=(Main!$D35),CE4*(1+Main!$D34),CE4))","v":11381.654248633045},{"$f":"IF(CG2<=Main!$D33,CF4*(1+Main!$D32),IF(CG2<=(Main!$D35),CF4*(1+Main!$D34),CF4))","v":11723.103876092036},{"$f":"IF(CH2<=Main!$D33,CG4*(1+Main!$D32),IF(CH2<=(Main!$D35),CG4*(1+Main!$D34),CG4))","v":12074.796992374799},null,"Alt Contribution rate (total)",{"$f":"IF(CK2<=Main!$D33,CH4*(1+Main!$D32),IF(CK2<=(Main!$D35),CH4*(1+Main!$D34),CH4))","v":12437.040902146044},{"$f":"IF(CL2<=Main!$D33,CK4*(1+Main!$D32),IF(CL2<=(Main!$D35),CK4*(1+Main!$D34),CK4))","v":12747.966924699693},{"$f":"IF(CM2<=Main!$D33,CL4*(1+Main!$D32),IF(CM2<=(Main!$D35),CL4*(1+Main!$D34),CL4))","v":13066.666097817184},{"$f":"IF(CN2<=Main!$D33,CM4*(1+Main!$D32),IF(CN2<=(Main!$D35),CM4*(1+Main!$D34),CM4))","v":13393.332750262613},{"$f":"IF(CO2<=Main!$D33,CN4*(1+Main!$D32),IF(CO2<=(Main!$D35),CN4*(1+Main!$D34),CN4))","v":13728.166069019177},{"$f":"IF(CP2<=Main!$D33,CO4*(1+Main!$D32),IF(CP2<=(Main!$D35),CO4*(1+Main!$D34),CO4))","v":14071.370220744655}]
[null,null,null,null,null,null,null,null,null,null,null,null,null,null,null,null,null,null,null,null,null,null,null,null,null,null,null,null,null,null,null,null,null,null,null,null,null,null,null,null,null,null,null,null,null,null,null,null,null,null,null,null,"Alt Interest Earnings",{"$f":"IF((BB7+(BB4+BB26-BB42)/2)>0,(BB7+(BB4+BB26-BB42)/2)*Main!$D67,0)","v":1550.3239270480649},{"$f":"IF((BC7+(BC4+BC26-BC42)/2)>0,(BC7+(BC4+BC26-BC42)/2)*Main!$D67,0)","v":1387.8749522960118},{"$f":"IF((BD7+(BD4+BD26-BD42)/2)>0,(BD7+(BD4+BD26-BD42)/2)*Main!$D67,0)","v":1464.2026356515223},{"$f":"IF((BE7+(BE4+BE26-BE42)/2)>0,(BE7+(BE4+BE26-BE42)/2)*Main!$D67,0)","v":1543.1686583046851},{"$f":"IF((BF7+(BF4+BF26-BF42)/2)>0,(BF7+(BF4+BF26-BF42)/2)*Main!$D67,0)","v":1598.0019800170096},null,"Alt Interest Earnings",{"$f":"IF((BI7+(BI4+BI26-BI42)/2)>0,(BI7+(BI4+BI26-BI42)/2)*Main!$D67,0)","v":1640.8141596621999},{"$f":"IF((BJ7+(BJ4+BJ26-BJ42)/2)>0,(BJ7+(BJ4+BJ26-BJ42)/2)*Main!$D67,0)","v":1712.9552183114458},{"$f":"IF((BK7+(BK4+BK26-BK42)/2)>0,(BK7+(BK4+BK26-BK42)/2)*Main!$D67,0)","v":1793.2185331016412},{"$f":"IF((BL7+(BL4+BL26-BL42)/2)>0,(BL7+(BL4+BL26-BL42)/2)*Main!$D67,0)","v":1863.7318917890259},{"$f":"IF((BM7+(BM4+BM26-BM42)/2)>0,(BM7+(BM4+BM26-BM42)/2)*Main!$D67,0)","v":1897.3009308890657},null,"Alt Interest Earnings",{"$f":"IF((BP7+(BP4+BP26-BP42)/2)>0,(BP7+(BP4+BP26-BP42)/2)*Main!$D67,0)","v":1875.3550119901302},{"$f":"IF((BQ7+(BQ4+BQ26-BQ42)/2)>0,(BQ7+(BQ4+BQ26-BQ42)/2)*Main!$D67,0)","v":1904.7133307302915},{"$f":"IF((BR7+(BR4+BR26-BR42)/2)>0,(BR7+(BR4+BR26-BR42)/2)*Main!$D67,0)","v":2007.6884257124782},{"$f":"IF((BS7+(BS4+BS26-BS42)/2)>0,(BS7+(BS4+BS26-BS42)/2)*Main!$D67,0)","v":1819.1565721152124},{"$f":"IF((BT7+(BT4+BT26-BT42)/2)>0,(BT7+(BT4+BT26-BT42)/2)*Main!$D67,0)","v":1595.2322879651222},null,"Alt Interest Earnings",{"$f":"IF((BW7+(BW4+BW26-BW42)/2)>0,(BW7+(BW4+BW26-BW42)/2)*Main!$D67,0)","v":1373.3220082284433},{"$f":"IF((BX7+(BX4+BX26-BX42)/2)>0,(BX7+(BX4+BX26-BX42)/2)*Main!$D67,0)","v":1171.8991649600989},{"$f":"IF((BY7+(BY4+BY26-BY42)/2)>0,(BY7+(BY4+BY26-BY42)/2)*Main!$D67,0)","v":1264.7452245553411},{"$f":"IF((BZ7+(BZ4+BZ26-BZ42)/2)>0,(BZ7+(BZ4+BZ26-BZ42)/2)*Main!$D67,0)","v":1377.5606508926871},{"$f":"IF((CA7+(CA4+CA26-CA42)/2)>0,(CA7+(CA4+CA26-CA42)/2)*Main!$D67,0)","v":1076.1409478635007},null,"Alt Interest Earnings",{"$f":"IF((CD7+(CD4+CD26-CD42)/2)>0,(CD7+(CD4+CD26-CD42)/2)*Main!$D67,0)","v":679.52994369390683},{"$f":"IF((CE7+(CE4+CE26-CE42)/2)>0,(CE7+(CE4+CE26-CE42)/2)*Main!$D67,0)","v":700.49256102006609},{"$f":"IF((CF7+(CF4+CF26-CF42)/2)>0,(CF7+(CF4+CF26-CF42)/2)*Main!$D67,0)","v":820.20419471932769},{"$f":"IF((CG7+(CG4+CG26-CG42)/2)>0,(CG7+(CG4+CG26-CG42)/2)*Main!$D67,0)","v":944.49868219335724},{"$f":"IF((CH7+(CH4+CH26-CH42)/2)>0,(CH7+(CH4+CH26-CH42)/2)*Main!$D67,0)","v":596.1739439321027},null,"Alt Interest Earnings",{"$f":"IF((CK7+(CK4+CK26-CK42)/2)>0,(CK7+(CK4+CK26-CK42)/2)*Main!$D67,0)","v":221.64352670937731},{"$f":"IF((CL7+(CL4+CL26-CL42)/2)>0,(CL7+(CL4+CL26-CL42)/2)*Main!$D67,0)","v":324.0814367108257},{"$f":"IF((CM7+(CM4+CM26-CM42)/2)>0,(CM7+(CM4+CM26-CM42)/2)*Main!$D67,0)","v":440.26730612703471},{"$f":"IF((CN7+(CN4+CN26-CN42)/2)>0,(CN7+(CN4+CN26-CN42)/2)*Main!$D67,0)","v":560.86203416380602},{"$f":"IF((CO7+(CO4+CO26-CO42)/2)>0,(CO7+(CO4+CO26-CO42)/2)*Main!$D67,0)","v":613.9498220117955},{"$f":"IF((CP7+(CP4+CP26-CP42)/2)>0,(CP7+(CP4+CP26-CP42)/2)*Main!$D67,0)","v":116.23651410113948}]
[null,null,null,null,null,null,null,null,null,null,null,null,null,null,null,null,null,null,null,null,null,null,null,null,null,null,null,null,null,null,null,null,null,null,null,null,null,null,null,null,null,null,null,null,null,null,null,null,null,null,null,null,"Alt Starting Balance (for charts)",{"$f":"Main!D20","v":175103.11},{"$f":"IF(BB7+BB5+BB4+BB26-BB42>0,BB7+BB5+BB26+BB4-BB42,0)","v":135093.43392704806},{"$f":"IF(BC7+BC5+BC4+BC26-BC42>0,BC7+BC5+BC26+BC4-BC42,0)","v":142599.50887934407},{"$f":"IF(BD7+BD5+BD4+BD26-BD42>0,BD7+BD5+BD26+BD4-BD42,0)","v":150365.45751499559},{"$f":"IF(BE7+BE5+BE4+BE26-BE42>0,BE7+BE5+BE26+BE4-BE42,0)","v":158399.42455330028},null,"Alt Starting Balance (for charts)",{"$f":"IF(BF7+BF5+BF4+BF26-BF42>0,BF7+BF5+BF4+BF26-BF42,0)","v":161336.78201721728},{"$f":"IF(BI7+BI5+BI4+BI26-BI42>0,BI7+BI5+BI26+BI4-BI42,0)","v":166965.49899247149},{"$f":"IF(BJ7+BJ5+BJ4+BJ26-BJ42>0,BJ7+BJ5+BJ26+BJ4-BJ42,0)","v":175771.1248521652},{"$f":"IF(BK7+BK5+BK4+BK26-BK42>0,BK7+BK5+BK26+BK4-BK42,0)","v":183024.98334775327},{"$f":"IF(BL7+BL5+BL4+BL26-BL42>0,BL7+BL5+BL26+BL4-BL42,0)","v":189879.78936020951},null,"Alt Starting Balance (for charts)",{"$f":"IF(BM7+BM5+BM4+BM26-BM42>0,BM7+BM5+BM4+BM26-BM42,0)","v":189741.64412432496},{"$f":"IF(BP7+BP5+BP4+BP26-BP42>0,BP7+BP5+BP26+BP4-BP42,0)","v":185488.74044650586},{"$f":"IF(BQ7+BQ5+BQ4+BQ26-BQ42>0,BQ7+BQ5+BQ26+BQ4-BQ42,0)","v":195615.80296933936},{"$f":"IF(BR7+BR5+BR4+BR26-BR42>0,BR7+BR5+BR26+BR4-BR42,0)","v":206092.51106291817},{"$f":"IF(BS7+BS5+BS4+BS26-BS42>0,BS7+BS5+BS26+BS4-BS42,0)","v":157893.40935487309},null,"Alt Starting Balance (for charts)",{"$f":"IF(BT7+BT5+BT4+BT26-BT42>0,BT7+BT5+BT4+BT26-BT42,0)","v":161288.62341541582},{"$f":"IF(BW7+BW5+BW4+BW26-BW42>0,BW7+BW5+BW26+BW4-BW42,0)","v":113492.49375572416},{"$f":"IF(BX7+BX5+BX4+BX26-BX42>0,BX7+BX5+BX26+BX4-BX42,0)","v":120986.93629073349},{"$f":"IF(BY7+BY5+BY4+BY26-BY42>0,BY7+BY5+BY26+BY4-BY42,0)","v":132069.59645098302},{"$f":"IF(BZ7+BZ5+BZ4+BZ26-BZ42>0,BZ7+BZ5+BZ26+BZ4-BZ42,0)","v":143559.60948564074},null,"Alt Starting Balance (for charts)",{"$f":"IF(CA7+CA5+CA4+CA26-CA42>0,CA7+CA5+CA4+CA26-CA42,0)","v":71760.038867619951},{"$f":"IF(CD7+CD5+CD4+CD26-CD42>0,CD7+CD5+CD26+CD4-CD42,0)","v":64203.70158122135},{"$f":"IF(CE7+CE5+CE4+CE26-CE42>0,CE7+CE5+CE26+CE4-CE42,0)","v":75954.343898195832},{"$f":"IF(CF7+CF5+CF4+CF26-CF42>0,CF7+CF5+CF26+CF4-CF42,0)","v":88156.202341548196},{"$f":"IF(CG7+CG5+CG4+CG26-CG42>0,CG7+CG5+CG26+CG4-CG42,0)","v":100823.80489983359},null,"Alt Starting Balance (for charts)",{"$f":"IF(CH7+CH5+CH4+CH26-CH42>0,CH7+CH5+CH4+CH26-CH42,0)","v":18461.651359116702},{"$f":"IF(CK7+CK5+CK4+CK26-CK42>0,CK7+CK5+CK26+CK4-CK42,0)","v":25885.890963836588},{"$f":"IF(CL7+CL5+CL4+CL26-CL42>0,CL7+CL5+CL26+CL4-CL42,0)","v":38957.939325247105},{"$f":"IF(CM7+CM5+CM4+CM26-CM42>0,CM7+CM5+CM26+CM4-CM42,0)","v":49132.939220836088},{"$f":"IF(CN7+CN5+CN4+CN26-CN42>0,CN7+CN5+CN26+CN4-CN42,0)","v":63087.134005262509},{"$f":"IF(CO7+CO5+CO4+CO26-CO42>0,CO7+CO5+CO26+CO4-CO42,0)","v":59755.008601223148}]
[null,null,null,null,null,null,null,null,null,null,null,null,null,null,null,null,null,null,null,null,null,null,null,null,null,null,null,null,null,null,null,null,null,null,null,null,null,null,null,null,null,null,null,null,null,null,null,null,null,null,null,null,"Alt Starting Balance (for calcs)",{"$f":"Main!D20","v":175103.11},{"$f":"BB7+BB5+BB4+BB26-BB42","v":135093.43392704806},{"$f":"BC7+BC5+BC4+BC26-BC42","v":142599.50887934407},{"$f":"BD7+BD5+BD4+BD26-BD42","v":150365.45751499559},{"$f":"BE7+BE5+BE4+BE26-BE42","v":158399.42455330028},null,"Alt Starting Balance (for calcs)",{"$f":"BF7+BF5+BF4+BF26-BF42","v":161336.78201721728},{"$f":"BI7+BI5+BI4+BI26-BI42","v":166965.49899247149},{"$f":"BJ7+BJ5+BJ4+BJ26-BJ42","v":175771.1248521652},{"$f":"BK7+BK5+BK4+BK26-BK42","v":183024.98334775327},{"$f":"BL7+BL5+BL4+BL26-BL42","v":189879.78936020951},null,"Alt Starting Balance (for calcs)",{"$f":"BM7+BM5+BM4+BM26-BM42","v":189741.64412432496},{"$f":"BP7+BP5+BP4+BP26-BP42","v":185488.74044650586},{"$f":"BQ7+BQ5+BQ4+BQ26-BQ42","v":195615.80296933936},{"$f":"BR7+BR5+BR4+BR26-BR42","v":206092.51106291817},{"$f":"BS7+BS5+BS4+BS26-BS42","v":157893.40935487309},null,"Alt Starting Balance (for calcs)",{"$f":"BT7+BT5+BT4+BT26-BT42","v":161288.62341541582},{"$f":"BW7+BW5+BW4+BW26-BW42","v":113492.49375572416},{"$f":"BX7+BX5+BX4+BX26-BX42","v":120986.93629073349},{"$f":"BY7+BY5+BY4+BY26-BY42","v":132069.59645098302},{"$f":"BZ7+BZ5+BZ4+BZ26-BZ42","v":143559.60948564074},null,"Alt Starting Balance (for calcs)",{"$f":"CA7+CA5+CA4+CA26-CA42","v":71760.038867619951},{"$f":"CD7+CD5+CD4+CD26-CD42","v":64203.70158122135},{"$f":"CE7+CE5+CE4+CE26-CE42","v":75954.343898195832},{"$f":"CF7+CF5+CF4+CF26-CF42","v":88156.202341548196},{"$f":"CG7+CG5+CG4+CG26-CG42","v":100823.80489983359},null,"Alt Starting Balance (for calcs)",{"$f":"CH7+CH5+CH4+CH26-CH42","v":18461.651359116702},{"$f":"CK7+CK5+CK4+CK26-CK42","v":25885.890963836588},{"$f":"CL7+CL5+CL4+CL26-CL42","v":38957.939325247105},{"$f":"CM7+CM5+CM4+CM26-CM42","v":49132.939220836088},{"$f":"CN7+CN5+CN4+CN26-CN42","v":63087.134005262509},{"$f":"CO7+CO5+CO4+CO26-CO42","v":59755.008601223148}]
[null,null,null,null,null,null,null,null,null,null,null,null,null,null,null,null,null,null,null,null,null,null,null,null,null,null,null,null,null,null,null,null,null,null,null,null,null,null,null,null,null,null,null,null,null,null,null,null,null,null,null,null,"Alt Percent Funded",{"$f":"IF(BB6/DV42<0,0,BB6/DV42)","v":1.7067966209081309},{"$f":"IF(BC6/DW42<0,0,BC6/DW42)","v":2.0576599353993563},{"$f":"IF(BD6/DX42<0,0,BD6/DX42)","v":1.8567567221938837},{"$f":"IF(BE6/DY42<0,0,BE6/DY42)","v":1.6979622947002995},{"$f":"IF(BF6/DZ42<0,0,BF6/DZ42)","v":1.5691071684055262},null,"Alt Percent Funded",{"$f":"IF(BI6/EA42<0,0,BI6/EA42)","v":1.4869969770705156},{"$f":"IF(BJ6/EB42<0,0,BJ6/EB42)","v":1.4019314243347856},{"$f":"IF(BK6/EC42<0,0,BK6/EC42)","v":1.318533185729853},{"$f":"IF(BL6/ED42<0,0,BL6/ED42)","v":1.2504719391117556},{"$f":"IF(BM6/EE42<0,0,BM6/EE42)","v":1.1909735882115364},null,"Alt Percent Funded",{"$f":"IF(BP6/EF42<0,0,BP6/EF42)","v":1.1446707881527747},{"$f":"IF(BQ6/EG42<0,0,BQ6/EG42)","v":1.1029646423051886},{"$f":"IF(BR6/EH42<0,0,BR6/EH42)","v":1.0542433639020619},{"$f":"IF(BS6/EI42<0,0,BS6/EI42)","v":1.011148399189574},{"$f":"IF(BT6/EJ42<0,0,BT6/EJ42)","v":0.97156110459239686},null,"Alt Percent Funded",{"$f":"IF(BW6/EK42<0,0,BW6/EK42)","v":0.92979594268412225},{"$f":"IF(BX6/EL42<0,0,BX6/EL42)","v":0.85735654055818844},{"$f":"IF(BY6/EM42<0,0,BY6/EM42)","v":0.82115456133421327},{"$f":"IF(BZ6/EN42<0,0,BZ6/EN42)","v":0.79328813414946042},{"$f":"IF(CA6/EO42<0,0,CA6/EO42)","v":0.76915405280736815},null,"Alt Percent Funded",{"$f":"IF(CD6/EP42<0,0,CD6/EP42)","v":0.5878208897616104},{"$f":"IF(CE6/EQ42<0,0,CE6/EQ42)","v":0.52497381106351293},{"$f":"IF(CF6/ER42<0,0,CF6/ER42)","v":0.53285541601781616},{"$f":"IF(CG6/ES42<0,0,CG6/ES42)","v":0.53789888970630406},{"$f":"IF(CH6/ET42<0,0,CH6/ET42)","v":0.54092844921938621},null,"Alt Percent Funded",{"$f":"IF(CK6/EU42<0,0,CK6/EU42)","v":0.16452907803230399},0.20091758105697949,0.25644115393304445,0.28427841873177584,0.31797441341961519,0.28846720857490166]
{"$rows_left_out":37}
{"sheet":"Starting Bal","index":3,"n_rows":89,"n_cols":8,"rows_kept":89,"cut":false,"hidden":false,"merged":[[6,0,6,7],[11,1,11,3],[8,1,8,2],[9,1,9,2],[8,3,8,5],[24,1,24,5],[22,1,22,5],[12,2,12,3],[20,2,20,5],[31,1,31,5],[23,1,23,5],[21,1,21,5],[35,1,35,5],[25,1,25,5],[30,1,30,5],[32,1,32,5],[34,1,34,5],[33,1,33,5]]}
[null,null,"Reserve Study Starting Reserve Balance Projection"]
[]
[]
[]
[]
[]
["Document your work in the shaded areas B, C, D, & E below"]
[]
{"$rows_left_out":82}
{"sheet":"Addnl Info","index":4,"n_rows":24,"n_cols":8,"rows_kept":24,"cut":false,"hidden":false,"merged":[[23,1,23,7],[8,1,8,7],[27,1,27,7],[28,1,28,7],[24,1,24,7],[25,1,25,7],[26,1,26,7],[18,1,18,7],[19,1,19,7],[20,1,20,7],[17,1,17,7],[0,1,0,7],[16,1,16,7],[4,1,4,7],[2,1,2,2],[9,1,9,7],[10,1,10,7],[11,1,11,7],[12,1,12,7]]}
[null,{"$f":"'Starting Bal'!C1","v":"Reserve Study Starting Reserve Balance Projection"}]
[]
[null,"Association Name:",null,{"$f":"Main!D11","v":"Kings Row HOA"},null,null,"#",{"$f":"Main!ClientNumber","v":"16151-1"}]
[]
[null,"Please enter additional information, as applicable, in the shaded spaces below"]
[]
[null,"Significant Recent Reserve Expenses:"]
[null,"(Description of what, when, $)"]
{"$rows_left_out":17}
{"sheet":"30-yr","index":5,"n_rows":58,"n_cols":12,"rows_kept":58,"cut":false,"hidden":false,"merged":[[57,1,57,2],[5,1,5,3],[54,1,54,2],[55,1,55,2],[56,1,56,2],[7,8,8,11],[10,5,10,6],[11,5,11,6],[12,5,12,6],[7,1,7,6],[8,1,8,6]]}
[]
[null,"Table 5:  30-Year Reserve Plan Summary",null,null,null,null,null,null,null,null,null,{"$f":"Main!D10","v":"16151-1"}]
[]
[]
[]
[null,"Fiscal Year Start:",null,null,{"$f":"Main!StartDate","v":"2015-01-01"},null,null,null,"Interest:",{"$f":"Main!InterestRate","v":0.01},"Inflation:",{"$f":"Main!InflationRate","v":0.03}]
[]
[null,"Reserve Fund Strength Calculations",null,null,null,null,null,null,"Projected Reserve Balance Changes"]
{"$rows_left_out":51}
{"sheet":"Budget Sum","index":6,"n_rows":17,"n_cols":14,"rows_kept":17,"cut":false,"hidden":false,"merged":[[17,8,17,10],[7,4,7,5],[7,6,7,7]]}
[null,null,null,null,4,4,5,5,9,50,45,30,null,46]
[]
[null,null,"Reserve Budget Funding Summary"]
[null,null,{"$f":"Main!ClientNumber","v":"16151-1"},{"$f":"Main!ClientName","v":"Kings Row HOA"}]
[]
[]
[null,null,null,null,null,null,{"$f":"Main!BaseYear","v":2015},null,"Estimated",null,{"$f":"Main!StartDate","v":"2015-01-01"},{"$f":"Main!StartDate","v":"2015-01-01"}]
[null,null,null,null,"Useful Life",null,"Rem. Useful Life",null,"Replacement",{"$f":"Main!BaseYear","v":2015},"Current Fund","Fully Funded","Remaining Bal.",{"$f":"Main!BaseYear","v":2015}]
{"$rows_left_out":10}
{"sheet":"Thermometer","index":7,"n_rows":12,"n_cols":3,"rows_kept":12,"cut":false,"hidden":false,"merged":[]}
["X","Y","Labels"]
[0.15,-0.05,"High"]
[0.5,-0.05,"Medium"]
[1,-0.05,"Low"]
[1.5,-0.05]
[{"$f":"MIN(A11,C7)","v":1.59},7.0000000000000007E-2,"Max Value"]
[null,0,1.59]
[0.3,0]
{"$rows_left_out":5}
{"sheet":"Solver","index":12,"n_rows":47,"n_cols":34,"rows_kept":47,"cut":false,"hidden":false,"merged":[[0,2,0,3]]}
[1,null,"Initial Settings:",null,null,null,null,null,null,"= administrator initial settings"]
[2,null,"Initial Contrib:",{"$f":"Data!AW42/12","v":14591.925833333335},"InitialContribution",null,null,null,null,"= computed diagnostics used by solver"]
[3,null,"# of units",{"$f":"Main!NumUnits","v":45},"NumUnits"]
[4,null,"1AI & 2AI",0.03,"AnnualIncreasePct"]
[5,null,"1AIY & 2AIY",30,"AnnualIncreaseYears"]
[6,null,"Initial Cycle Contrib Change",0.01,"ContributionChangeCycle1",null,null,"Counters"]
[7,null,"2nd Cycle Contrib Change",5.0000000000000001E-3,"ContributionChangeCycle2",null,null,"Pass #",1]
[8,null,"Min Expense Remainder",0.1,"MinExpRemainder",null,null,"Cycle1",296]
{"$rows_left_out":40}
{"sheet":"Coding-F","index":13,"n_rows":199,"n_cols":5,"rows_kept":199,"cut":false,"hidden":false,"merged":[]}
["Note: all cell references refer to \"Solver\" worksheet unless otherwise designated"]
["Full Funding Solver"]
[]
["Start","set annual increases"]
[null,null,"Set 1AI = d4",null,"(1st ramp annual increase)"]
[null,null,"Set 1AIY = d5",null,"(1st ramp annual increase years)"]
[null,null,"Set 2AI = d4",null,"(2nd ramp annual increase)"]
[null,null,"Set 2AIY = d5",null,"(2nd ramp annual increase years)"]
{"$rows_left_out":192}
{"sheet":"Coding-B","index":14,"n_rows":127,"n_cols":12,"rows_kept":127,"cut":false,"hidden":false,"merged":[]}
["Note: all cell references refer to \"Solver\" worksheet unless otherwise designated"]
["Baseline Solver"]
[]
["Start","Set Cycle Counters"]
[null,null,"set cycle1 = 0"]
[null,null,"set cycle2 = 0"]
[null,"Set Annual Increases"]
[null,null,"set 1AI = d4"]
{"$rows_left_out":120}
{"sheet":"Output-F","index":15,"n_rows":19,"n_cols":8,"rows_kept":19,"cut":false,"hidden":false,"merged":[]}
["Cycle 2 #","Contrib","1AI Yrs","2AI %","Slope","% Funded","At the End of Branch","Last Operation"]
[null,752.48,30,0.03,-1.1325237821221901E-2,1.198447095710468,"Cycle 2","Reset 2AI"]
[1,748.72,25,3.4999999999999996E-2,-1.1204828433487579E-2,1.1855842279391859,"Cycle 2 Low","Trim"]
[null,748.72,25,0.03,-1.1805561017779631E-2,1.1845226658004917,"Cycle 2","Reset 2AI"]
[2,744.97,25,3.4999999999999996E-2,-1.1685754630077838E-2,1.1717240847490162,"Cycle 2 Low","Trim"]
[null,744.97,25,0.03,-1.2283483551049291E-2,1.1706678304217206,"Cycle 2","Reset 2AI"]
[3,741.25,25,3.4999999999999996E-2,-1.2164277729577044E-2,1.1579331980685132,"Cycle 2 Low","Trim"]
[null,741.25,25,0.03,-1.2759017995964373E-2,1.1568822250304887,"Cycle 2","Reset 2AI"]
{"$rows_left_out":12}
{"sheet":"Output-B","index":16,"n_rows":337,"n_cols":9,"rows_kept":337,"cut":false,"hidden":false,"merged":[]}
["Loop #","Contrib","Special Assmt","Margin1","MinEndBalMargin","1AI Yrs","2AI %","Cycle #","Last Operation"]
[1,14446.01,0,true,1,30,3.4999999999999996E-2,"Cycle 1","Cycle1-high"]
[2,14301.55,0,true,1,30,3.4999999999999996E-2,"Cycle 1","Cycle1-high"]
[3,14158.54,0,true,1,30,3.4999999999999996E-2,"Cycle 1","Cycle1-high"]
[4,14016.95,0,true,1,30,3.4999999999999996E-2,"Cycle 1","Cycle1-high"]
[5,13876.78,0,true,1,30,3.4999999999999996E-2,"Cycle 1","Cycle1-high"]
[6,13738.01,0,true,1,30,3.4999999999999996E-2,"Cycle 1","Cycle1-high"]
[7,13600.63,0,true,1,30,3.4999999999999996E-2,"Cycle 1","Cycle1-high"]
{"$rows_left_out":330}
{"sheet":"SA Risk","index":17,"n_rows":0,"n_cols":0,"rows_kept":0,"cut":false,"hidden":false,"merged":[]}

{"sheet":"wksCommandBars","index":18,"n_rows":26,"n_cols":25,"rows_kept":26,"cut":false,"hidden":true,"merged":[]}
["Command Bar Name","Control Caption","Control Caption","Control Caption","Position","IsMenubar","Visible","Width","Protection","IsTemporary","IsEnabled","OnAction","Control ID","Control Type","Control Style","Face ID","Begin Group","Before","Tooltip","Shortcut Text","Tag","Parameter","State","ListRange","Lists"]
["Worksheet Menu Bar"]
[null,"&ARI",null,null,null,null,null,null,null,null,null,null,null,{"$f":"msoControlPopup","v":10},null,null,null,"Window"]
[null,null,"&Insert Data Table Row",null,null,null,null,null,null,null,null,"InsertDataSheetRow",1,{"$f":"msoControlButton","v":1},{"$f":"msoButtonIconAndCaption","v":3},296,null,null,null,"Ctrl+Shift+I"]
[null,null,"&Delete Data Table Row",null,null,null,null,null,null,null,null,"DeleteDataSheetRow",1,1,3,293,null,null,null,"Ctrl+Shift+D"]
[null,null,"&Remove Unused Data Rows",null,null,null,null,null,null,null,null,"RemoveUnusedDataSheetRows",1,1,3,541,null,null,null,"Ctrl+Shift+R"]
[null,null,"&Sort Data Table",null,null,null,null,null,null,null,null,"SortDataSheet",1,1,3,210,true]
[null,null,"Restore Data Table &Format",null,null,null,null,null,null,null,null,"ReformatDataInputArea",1,1,3,369]
{"$rows_left_out":18}